{"text_format":"1","workbook":"xlsx","n_sheets":4,"sheets":["PvT","ASME B16.34","API 6D","ASME B16.5"],"not_rendered":{"charts":0,"images":5,"macros":1,"external_links":0,"defined_names":25,"comments":0,"pivot_tables":0},"unopened":[],"bounds":{"document_bytes":16777216,"sheet_cells":100000,"rows_first":2000,"rows_last":500,"rows_between":2000,"halvings":0,"cell_chars":16384,"cell_head_chars":4096},"cells_cut":0,"cells_raw":0,"read":"whole","date_system":"1900"}

{"sheet":"PvT","index":0,"n_rows":80,"n_cols":39,"rows_kept":80,"cut":false,"hidden":false,"merged":[]}
[]
[null,"INTERMEDIATE PRESSURE/TEMPERATURE CLASS LIMITS"]
[null,null,null,null,null,null,null,null,null,null,null,null,null,null,null,"MATERIALS:",null,null,null,null,null,null,null,null,null,null,null,null,"Date","Rev#","Notes"]
[null,null,"SELECT INDUSTRY STANDARD & MATERIAL GROUP",null,null,null,null,null,null,null,null,null,null,null,null,null,{"$f":"INDEX(INDIRECT(CONCATENATE(VLOOKUP(AI$39,IND_REFERENCE,2,FALSE),VLOOKUP(AI$39,IND_REFERENCE,3,FALSE))),0,1)","v":"ASME B16.34 (2017) Group 2.1"},null,null,null,null,{"$f":"INDEX(INDIRECT(CONCATENATE(VLOOKUP(AI$39,IND_REFERENCE,2,FALSE),VLOOKUP(AI$39,IND_REFERENCE,3,FALSE))),0,2)","v":"Notes"},null,null,null,null,null,null,"2019-06-10","00","Initial release"]
[null,null,null,null,null,null,null,null,null,null,null,null,null,null,null,null,"Castings",null,null,null,null,0,null,null,null,{"$f":"IF(OR(Q5=\"Castings\",Q5=\"Forgings\",LEFT(Q5,3)=\"Bar\",Q5=\"Plates\"),1,0)","v":1},null,null,"2019-06-24","01","Adjusted Materials table so 'Notes' column would not cover up and material names."]
[null,null,null,null,null,null,null,null,null,null,null,null,null,null,null,null,"A351 Gr. CF3",null,null,null,null,"up to 800°F/427°C",null,null,null,{"$f":"IF(OR(Q6=\"Castings\",Q6=\"Forgings\",LEFT(Q6,3)=\"Bar\",Q6=\"Plates\"),1,0)","v":0},null,null,null,"01","Relocated PClassInput cell to avoid accidental user override."]
[null,null,"SELECT PRESSURE CLASS",null,null,null,null,null,null,null,null,null,null,null,null,null,"A351 Gr. CF8, CF10",null,null,null,null,0,null,null,null,0]
[null,null,null,null,{"$f":"IF(ISERROR(SEARCH(\"B16.34\",AI39)),1,0)","v":0},null,null,null,null,null,null,null,null,null,null,null,"Forgings",null,null,null,null,0,null,null,null,1]
[null,null,null,null,null,null,null,null,null,null,null,null,null,null,null,null,"A182 Gr. F304, F304H",null,null,null,null,0,null,null,null,0]
[null,null,"SELECT  CALCULATION TYPE",null,null,null,null,null,null,null,null,null,null,null,null,null,"Bar",null,null,null,null,0,null,null,null,1]
[null,null,null,null,null,null,null,null,null,null,null,null,null,null,null,null,"A182 Gr. F304, F304H",null,null,null,null,0,null,null,null,0]
[null,null,null,null,null,null,null,null,null,null,null,null,null,null,null,null,"A479 Gr. 304, 304H",null,null,null,null,0,null,null,null,0]
[null,null,null,null,null,null,null,null,null,null,null,null,null,null,null,null,"Plates",null,null,null,null,0,null,null,null,1]
[null,null,null,null,null,null,null,null,null,null,null,null,null,null,null,null,"A240 Gr. 304, 304H",null,null,null,null,0,null,null,null,0]
[null,null,null,null,null,null,null,null,null,null,null,null,null,null,null,null,0,null,null,null,null,0,null,null,null,0]
[null,null,null,null,null,null,{"$f":"IF(AI51=TRUE,\"ENTER PRESSURE --> \",\"ENTER TEMPERATURE--> \")","v":"ENTER TEMPERATURE--> "},200,{"$f":"IF(AI51=TRUE,\"psig\",\"ºF\")","v":"ºF"},null,null,null,null,null,null,null,0,null,null,null,null,0,null,null,null,0]
[null,null,null,null,null,null,{"$f":"IF(AI51=TRUE,\"MAX RATED TEMPERATURE = \",\"MAX RATED PRESSURE =\")","v":"MAX RATED PRESSURE ="},{"$f":"IFERROR(IF(AI51=TRUE,IF($H$16=INDEX(INDIRECT(\"COL_\"&$AE$57),1),100,IF($H$16<MIN(INDIRECT(\"COL_\"&$AE$57)),1000,(H16-AD57)/(AD56-AD57)*(AD55-AD54)+AD54)),(H16-MaxPress_LT)/(MaxPress_HT-MaxPress_LT)*(MaxPress_LP-MaxPress_HP)+MaxPress_HP),\"\")","v":230},{"$f":"IF(AI51=TRUE,\"ºF\",\"psig\")","v":"psig"},null,null,null,null,null,null,null,0,null,null,null,null,0,null,null,null,0]
[null,null,null,null,"NOTES:",null,null,null,null,null,null,null,null,null,null,null,0,null,null,null,null,0,null,null,null,0]
[null,null,null,null,{"$f":"IF(AI51=TRUE,\"Pressure class\",\"Temp range\")","v":"Temp range"},null,{"$f":"IF(AI51=TRUE,IF(H16<=MAX(INDIRECT(\"COL_\"&$AE$57)),\"OK\",\"Exceeds pressure class\"),IF(OR(InterTemp<-20,InterTemp>1000),\"Data not available\",\"OK\"))","v":"OK"},null,null,null,null,null,null,null,null,null,"",null,null,null,null,0,null,null,null,0]
[]
[]
[null,null,null,null,null,null,null,null,null,null,null,null,null,null,null,{"$f":"\"PRESSURE/TEMP RATING - \"&AI39","v":"PRESSURE/TEMP RATING - ASME B16.34 (2017) -  Matl Gp. 2.1 (US Units)"}]
[null,null,null,null,null,null,null,null,null,null,null,null,null,null,null,null,"ºF",1,{"$f":"INDEX(INDIRECT(CONCATENATE(VLOOKUP(AI$39,IND_REFERENCE,2,FALSE),VLOOKUP(AI$39,IND_REFERENCE,4,FALSE))),0,1)","v":150},{"$f":"INDEX(INDIRECT(CONCATENATE(VLOOKUP(AI$39,IND_REFERENCE,2,FALSE),VLOOKUP(AI$39,IND_REFERENCE,4,FALSE))),0,2)","v":300},{"$f":"INDEX(INDIRECT(CONCATENATE(VLOOKUP(AI$39,IND_REFERENCE,2,FALSE),VLOOKUP(AI$39,IND_REFERENCE,4,FALSE))),0,3)","v":600},{"$f":"INDEX(INDIRECT(CONCATENATE(VLOOKUP(AI$39,IND_REFERENCE,2,FALSE),VLOOKUP(AI$39,IND_REFERENCE,4,FALSE))),0,4)","v":900},{"$f":"INDEX(INDIRECT(CONCATENATE(VLOOKUP(AI$39,IND_REFERENCE,2,FALSE),VLOOKUP(AI$39,IND_REFERENCE,4,FALSE))),0,5)","v":1500},{"$f":"INDEX(INDIRECT(CONCATENATE(VLOOKUP(AI$39,IND_REFERENCE,2,FALSE),VLOOKUP(AI$39,IND_REFERENCE,4,FALSE))),0,6)","v":2500},{"$f":"INDEX(INDIRECT(CONCATENATE(VLOOKUP(AI$39,IND_REFERENCE,2,FALSE),VLOOKUP(AI$39,IND_REFERENCE,4,FALSE))),0,7)","v":4500}]
[null,null,null,null,null,null,null,null,null,null,null,null,null,null,null,1,-20,2,275,720,1440,2160,3600,6000,10800]
[null,null,null,null,null,null,null,null,null,null,null,null,null,null,null,2,100,3,275,720,1440,2160,3600,6000,10800]
[null,null,null,null,null,null,null,null,null,null,null,null,null,null,null,3,200,4,230,600,1200,1800,3000,5000,9000]
[null,null,null,null,null,null,null,null,null,null,null,null,null,null,null,4,300,5,205,540,1075,1615,2690,4480,8065]
[null,null,null,null,null,null,null,null,null,null,null,null,null,null,null,5,400,6,190,495,995,1490,2485,4140,7450]
[null,null,null,null,null,null,null,null,null,null,null,null,null,null,null,6,500,7,170,465,930,1395,2330,3880,6985]
[null,null,null,null,null,null,null,null,null,null,null,null,null,null,null,7,600,8,140,440,885,1325,2210,3680,6625]
[null,null,null,null,null,null,null,null,null,null,null,null,null,null,null,8,650,9,125,430,865,1295,2160,3600,6480]
[null,null,null,null,null,null,null,null,null,null,null,null,null,null,null,9,700,10,110,420,845,1265,2110,3520,6335]
[null,null,null,null,null,null,null,null,null,null,null,null,null,null,null,10,750,11,95,415,825,1240,2065,3440,6190]
[null,null,null,"9955 International Blvd. | Cincinnati, Ohio 45246",null,null,null,null,null,null,null,null,null,null,null,11,800,12,80,405,810,1215,2030,3380,6085]
[null,null,null,"Phone: 513.247.5465 | Fax: 513.247.5462 | www.atcontrols.com",null,null,null,null,null,null,null,null,null,null,null,12,850,13,65,395,790,1190,1980,3300,5940]
[null,null,null,null,null,null,null,null,null,null,null,null,null,null,null,13,900,14,50,390,780,1165,1945,3240,5830]
[null,null,null,null,null,null,null,null,null,null,null,null,null,null,null,14,950,15,35,380,765,1145,1910,3180,5725]
[null,null,null,null,null,null,null,null,null,null,null,null,null,null,null,15,1000,16,20,355,710,1065,1770,2950,5315]
[null,null,null,null,null,null,null,null,null,null,null,null,null,null,null,null,null,null,null,null,null,null,null,null,null,null,null,null,null,null,null,null,null,null,"ASME B16.34 (2017) -  Matl Gp. 2.1 (US Units)"]
[]
[null,null,null,null,null,null,null,null,null,null,null,null,null,null,null,null,null,null,null,null,null,null,null,null,null,"GGRIF-CAF-0001 rev-01 (28-Jun-19)"]
[null,null,null,null,null,null,null,null,null,null,null,null,null,null,null,null,null,null,null,null,null,null,null,null,null,null,null,null,null,null,null,null,null,null,"PRESSURE CLASS SELECTION"]
[null,null,null,null,null,null,null,null,null,null,null,null,null,null,null,null,null,null,null,null,null,null,null,null,null,null,null,null,null,null,null,null,null,null,150]
[]
[]
[null,null,null,null,null,null,null,null,null,null,null,null,null,null,null,null,null,null,null,null,null,null,null,null,null,null,null,null,"PRESSURE & TEMPERATURE CALCULATIONS",null,null,null,null,null,"Find Max Rated Pressure (known temperature)","LIST BOX OPTION"]
[null,null,null,null,null,null,null,null,null,null,null,null,null,null,null,null,null,null,null,null,null,null,null,null,null,null,null,null,"FIND MAX PRESSURE",null,null,null,null,null,null,"Find Max Rated Temperature (known pressure)"]
[null,null,null,null,null,null,null,null,null,null,null,null,null,null,null,null,null,null,null,null,null,null,null,null,null,null,null,null,"TempL",{"$f":"VLOOKUP(H16,TEMP_RNG,1)","v":200},null," MaxPress_LT value",null,null,null,"Find Max Rated Pressure (known temperature)"]
[null,null,null,null,null,null,null,null,null,null,null,null,null,null,null,null,null,null,null,null,null,null,null,null,null,null,null,null,"TempH",{"$f":"INDEX($Q$23:$Q$38,VLOOKUP(AD48,TEMP_RNG,2,0)+1)","v":300},null," MaxPress_HT value"]
[null,null,null,null,null,null,null,null,null,null,null,null,null,null,null,null,null,null,null,null,null,null,null,null,null,null,null,null,"PressH",{"$f":"HLOOKUP(PClassInput,$Q$23:$Y$38,VLOOKUP(AD48,TEMP_RNG,2))","v":230},null," MaxPress_HP value"]
[null,null,null,null,null,null,null,null,null,null,null,null,null,null,null,null,null,null,null,null,null,null,null,null,null,null,null,null,"PressL",{"$f":"HLOOKUP(PClassInput,$Q$23:$Y$38,VLOOKUP(AD49,TEMP_RNG,2))","v":205},null," MaxPress_LP value",null,null,false,"Find Max Rated Temperature (known pressure)"]
[]
[null,null,null,null,null,null,null,null,null,null,null,null,null,null,null,null,null,null,null,null,null,null,null,null,null,null,null,null,"FIND MAX TEMP"]
[null,null,null,null,null,null,null,null,null,null,null,null,null,null,null,null,null,null,null,null,null,null,null,null,null,null,null,null,"TempH",{"$f":"INDEX($Q$24:$Q$38,MATCH(AD57,INDIRECT(CONCATENATE(\"COL_\",$AE$57)),0)+IF(AE54=\"Y\",1,0))","v":400},{"$f":"IF($H$16=HLOOKUP(PClassInput,RATINGS_TABLE,2,FALSE),\"Y\",0)","v":0}," MaxTemp_HT value"]
[null,null,null,null,null,null,null,null,null,null,null,null,null,null,null,null,null,null,null,null,null,null,null,null,null,null,null,null,"TempL",{"$f":"INDEX($Q$24:$Q$38,MATCH(AD56,INDIRECT(CONCATENATE(\"COL_\",$AE$57)),0)+IF(AE55=\"Y\",1,0))","v":300},{"$f":"IF(AND($H$16>HLOOKUP(PClassInput,RATINGS_TABLE,4,FALSE),$H$16<HLOOKUP(PClassInput,RATINGS_TABLE,2,FALSE)),\"Y\",0)","v":0}," MaxTemp_LT value"]
[null,null,null,null,null,null,null,null,null,null,null,null,null,null,null,null,null,null,null,null,null,null,null,null,null,null,null,null,"PressH",{"$f":"INDEX(INDIRECT(CONCATENATE(\"COL_\",$AE$57)),MATCH($H$16,INDIRECT(CONCATENATE(\"COL_\",$AE$57)),-1))","v":205},null," MaxTemp_HP value"]
[null,null,null,null,null,null,null,null,null,null,null,null,null,null,null,null,null,null,null,null,null,null,null,null,null,null,null,null,"PressL",{"$f":"INDEX(INDIRECT(CONCATENATE(\"COL_\",$AE$57)),MATCH($H$16,INDIRECT(CONCATENATE(\"COL_\",$AE$57)),-1)+1)","v":190},{"$f":"MATCH(PClassInput,$S$23:$Y$23,0)","v":1}," MaxTemp_LP value"]
[]
[]
[null,null,null,null,null,null,null,null,null,null,null,null,null,null,null,null,null,null,null,null,null,null,null,null,null,null,null,null,"FLANGE RATINGS",null,null,null,null,null,null,"INDUSTRY STANDARDS & CALL REFERENCE","SHEET","MATERIALS","RATINGS"]
[null,null,null,null,null,null,null,null,null,null,null,null,null,null,null,null,null,null,null,null,null,null,null,null,null,null,null,null,"B16.5","B16.34","USED",null,null,null,null,"ASME B16.34 (2017) -  Matl Gp. 1.1 (US Units)","'ASME B16.34'!","$B$4:C$19","$F$4:$L$19"]
[null,null,null,null,null,null,null,null,null,null,null,null,null,null,null,null,null,null,null,null,null,null,null,null,null,null,null,null,150,150,{"$f":"IF(ISERROR(SEARCH(\"B16.34\",$AI$39)),$AC62,$AD62)","v":150},null,null,null,null,"ASME B16.34 (2017) -  Matl Gp. 1.2 (US Units)","'ASME B16.34'!","$B$21:$C$36","$F$21:$L$36"]
[null,null,null,null,null,null,null,null,null,null,null,null,null,null,null,null,null,null,null,null,null,null,null,null,null,null,null,null,300,300,{"$f":"IF(ISERROR(SEARCH(\"B16.34\",$AI$39)),$AC63,$AD63)","v":300},null,null,null,null,"ASME B16.34 (2017) -  Matl Gp. 1.3 (US Units)","'ASME B16.34'!","$B$38:$C$53","$F$38:$L$53"]
[null,null,null,null,null,null,null,null,null,null,null,null,null,null,null,null,null,null,null,null,null,null,null,null,null,null,null,null,400,600,{"$f":"IF(ISERROR(SEARCH(\"B16.34\",$AI$39)),$AC64,$AD64)","v":600},null,null,null,null,"ASME B16.34 (2017) -  Matl Gp. 2.1 (US Units)","'ASME B16.34'!","$P$4:$Q$19","$T$4:$Z$19"]
[null,null,null,null,null,null,null,null,null,null,null,null,null,null,null,null,null,null,null,null,null,null,null,null,null,null,null,null,600,900,{"$f":"IF(ISERROR(SEARCH(\"B16.34\",$AI$39)),$AC65,$AD65)","v":900},null,null,null,null,"ASME B16.34 (2017) -  Matl Gp. 2.2 (US Units)","'ASME B16.34'!","$P$21:$Q$36","$T$21:$Z$36"]
[null,null,null,null,null,null,null,null,null,null,null,null,null,null,null,null,null,null,null,null,null,null,null,null,null,null,null,null,900,1500,{"$f":"IF(ISERROR(SEARCH(\"B16.34\",$AI$39)),$AC66,$AD66)","v":1500},null,null,null,null,"ASME B16.34 (2017) -  Matl Gp. 2.3 (US Units)","'ASME B16.34'!","$P$38:$Q$53","$T$38:$Z$53"]
[null,null,null,null,null,null,null,null,null,null,null,null,null,null,null,null,null,null,null,null,null,null,null,null,null,null,null,null,1500,2500,{"$f":"IF(ISERROR(SEARCH(\"B16.34\",$AI$39)),$AC67,$AD67)","v":2500},null,null,null,null,"----------------------------------------------------------"]
[null,null,null,null,null,null,null,null,null,null,null,null,null,null,null,null,null,null,null,null,null,null,null,null,null,null,null,null,2500,4500,{"$f":"IF(ISERROR(SEARCH(\"B16.34\",$AI$39)),$AC68,$AD68)","v":4500},null,null,null,null,"API 6D (2014) - Matl Gp 1.1 (US Units)","'API 6D'!","$B$4:C$19","$F$4:$L$19"]
[null,null,null,null,null,null,null,null,null,null,null,null,null,null,null,null,null,null,null,null,null,null,null,null,null,null,null,null,null,null,null,null,null,null,null,"API 6D (2014) - Matl Gp. 1.2 (US Units)","'API 6D'!","$B$21:$C$36","$F$21:$L$36"]
[null,null,null,null,null,null,null,null,null,null,null,null,null,null,null,null,null,null,null,null,null,null,null,null,null,null,null,null,null,null,null,null,null,null,null,"API 6D (2014) - Matl Gp. 1.3 (US Units)","'API 6D'!","$B$38:$C$53","$F$38:$L$53"]
[null,null,null,null,null,null,null,null,null,null,null,null,null,null,null,null,null,null,null,null,null,null,null,null,null,null,null,null,null,null,null,null,null,null,null,"API 6D (2014) - Matl Gp 2.1 (US Units)","'API 6D'!","$P$4:$Q$19","$T$4:$Z$19"]
[null,null,null,null,null,null,null,null,null,null,null,null,null,null,null,null,null,null,null,null,null,null,null,null,null,null,null,null,null,null,null,null,null,null,null,"API 6D (2014) - Matl Gp 2.2 (US Units)","'API 6D'!","$P$21:$Q$36","$T$21:$Z$36"]
[null,null,null,null,null,null,null,null,null,null,null,null,null,null,null,null,null,null,null,null,null,null,null,null,null,null,null,null,null,null,null,null,null,null,null,"API 6D (2014) - Matl Gp 2.3 (US Units)","'API 6D'!","$P$38:$Q$53","$T$38:$Z$53"]
[null,null,null,null,null,null,null,null,null,null,null,null,null,null,null,null,null,null,null,null,null,null,null,null,null,null,null,null,null,null,null,null,null,null,null,"----------------------------------------------------------"]
[null,null,null,null,null,null,null,null,null,null,null,null,null,null,null,null,null,null,null,null,null,null,null,null,null,null,null,null,null,null,null,null,null,null,null,"ASME B16.5 (2017) - Matl Gp. 1.1 (US Units)","'ASME B16.5'!","$B$4:C$19","$F$4:$L$19"]
[null,null,null,null,null,null,null,null,null,null,null,null,null,null,null,null,null,null,null,null,null,null,null,null,null,null,null,null,null,null,null,null,null,null,null,"ASME B16.5 (2017) - Matl Gp. 1.2 (US Units)","'ASME B16.5'!","$B$21:$C$36","$F$21:$L$36"]
[null,null,null,null,null,null,null,null,null,null,null,null,null,null,null,null,null,null,null,null,null,null,null,null,null,null,null,null,null,null,null,null,null,null,null,"ASME B16.5 (2017) - Matl Gp. 1.3 (US Units)","'ASME B16.5'!","$B$38:$C$53","$F$38:$L$53"]
[null,null,null,null,null,null,null,null,null,null,null,null,null,null,null,null,null,null,null,null,null,null,null,null,null,null,null,null,null,null,null,null,null,null,null,"ASME B16.5 (2017) - Matl Gp. 2.1 (US Units)","'ASME B16.5'!","$P$4:$Q$19","$T$4:$Z$19"]
[null,null,null,null,null,null,null,null,null,null,null,null,null,null,null,null,null,null,null,null,null,null,null,null,null,null,null,null,null,null,null,null,null,null,null,"ASME B16.5 (2017) - Matl Gp. 2.2 (US Units)","'ASME B16.5'!","$P$21:$Q$36","$T$21:$Z$36"]
[null,null,null,null,null,null,null,null,null,null,null,null,null,null,null,null,null,null,null,null,null,null,null,null,null,null,null,null,null,null,null,null,null,null,null,"ASME B16.5 (2017) - Matl Gp. 2.3 (US Units)","'ASME B16.5'!","$P$38:$Q$53","$T$38:$Z$53"]

{"sheet":"ASME B16.34","index":1,"n_rows":53,"n_cols":26,"rows_kept":53,"cut":false,"hidden":true,"merged":[]}
["ASME B16.34 (2017)"]
[]
[]
[null,"ASME B16.34 (2017) Group 1.1","Notes",null,"ºF",150,300,600,900,1500,2500,4500,null,null,null,"ASME B16.34 (2017) Group 2.1","Notes",null,"ºF",150,300,600,900,1500,2500,4500]
[null,"Castings","",null,-20,285,740,1480,2220,3705,6170,11110,null,null,null,"Castings",null,null,-20,275,720,1440,2160,3600,6000,10800]
[null,"A216 WCB","up to 800°F/427°C",null,100,285,740,1480,2220,3705,6170,11110,null,null,null,"A351 Gr. CF3","up to 800°F/427°C",null,100,275,720,1440,2160,3600,6000,10800]
[null,"Forgings","",null,200,260,680,1360,2035,3395,5655,10185,null,null,null,"A351 Gr. CF8, CF10",null,null,200,230,600,1200,1800,3000,5000,9000]
[null,"A105","up to 800°F/427°C",null,300,230,655,1310,1965,3270,5450,9815,null,null,null,"Forgings",null,null,300,205,540,1075,1615,2690,4480,8065]
[null,"A350 Gr. LF2","up to 800°F/427°C",null,400,200,635,1265,1900,3170,5280,9505,null,null,null,"A182 Gr. F304, F304H",null,null,400,190,495,995,1490,2485,4140,7450]
[null,"A350 Gr. LF3","up to 650°F/343°C",null,500,170,605,1205,1810,3015,5025,9040,null,null,null,"Bar",null,null,500,170,465,930,1395,2330,3880,6985]
[null,"A350 Gr. LF6 Cl. 1","up to 500°F/260°C",null,600,140,570,1135,1705,2840,4730,8515,null,null,null,"A182 Gr. F304, F304H",null,null,600,140,440,885,1325,2210,3680,6625]
[null,"Bar","",null,650,125,550,1100,1650,2745,4575,8240,null,null,null,"A479 Gr. 304, 304H",null,null,650,125,430,865,1295,2160,3600,6480]
[null,"A105","up to 800°F/427°C",null,700,110,530,1060,1590,2655,4425,7960,null,null,null,"Plates",null,null,700,110,420,845,1265,2110,3520,6335]
[null,"A350 Gr. LF2, LF3, LF6 Cl. 1","up to 800°F/427°C",null,750,95,505,1015,1520,2535,4230,7610,null,null,null,"A240 Gr. 304, 304H",null,null,750,95,415,825,1240,2065,3440,6190]
[null,"A696 Gr. C","up to 700°F/371°C",null,800,80,410,825,1235,2055,3430,6170,null,null,null,null,null,null,800,80,405,810,1215,2030,3380,6085]
[null,"Plates","",null,850,65,320,640,955,1595,2655,4785,null,null,null,null,null,null,850,65,395,790,1190,1980,3300,5940]
[null,"A515 Gr. 70","up to 800°F/427°C",null,900,50,230,460,690,1150,1915,3455,null,null,null,null,null,null,900,50,390,780,1165,1945,3240,5830]
[null,"A516 Gr. 70","up to 800°F/427°C",null,950,35,135,275,410,685,1145,2055,null,null,null,null,null,null,950,35,380,765,1145,1910,3180,5725]
[null,"A537 Gr. Cl. 1","up to 700°F/371°C",null,1000,20,85,170,255,430,715,1285,null,null,null,"",null,null,1000,20,355,710,1065,1770,2950,5315]
[]
[null,"ASME B16.34 (2017) Group 1.2","Notes",null,"ºF",150,300,600,900,1500,2500,4500,null,null,null,"ASME B16.34 (2017) Group 2.2","Notes",null,"ºF",150,300,600,900,1500,2500,4500]
[null,"Castings",null,null,-20,290,750,1500,2250,3750,6250,11250,null,null,null,"Castings",null,null,-20,275,720,1440,2160,3600,6000,10800]
[null,"A352 Gr. LC2, LC3, LCC","up to 650°F/343°C",null,100,290,750,1500,2250,3750,6250,11250,null,null,null,"A351 Gr. CF3M","up to 800°F/427°C",null,100,275,720,1440,2160,3600,6000,10800]
[null,"A216 Gr. WCC","up to 800°F/427°C",null,200,260,750,1500,2250,3750,6250,11250,null,null,null,"A351 Gr. CF8M, CF10M, CG3M, CG8M",null,null,200,235,620,1240,1860,3095,5160,9290]
[null,"Forgings",null,null,300,230,730,1455,2185,3640,6070,10925,null,null,null,"A351 Gr. CF3A, CF8A","up to 650°F/343°C",null,300,215,560,1120,1680,2795,4660,8390]
[null,"A350 Gr. LF6 Cl. 2","up to 500°F/260°C",null,400,200,705,1405,2110,3520,5865,10555,null,null,null,"Forgings",null,null,400,195,515,1025,1540,2570,4280,7705]
[null,"Bar",null,null,500,170,665,1330,1995,3325,5540,9965,null,null,null,"A182 Gr. F316, F316H",null,null,500,170,480,955,1435,2390,3980,7165]
[null,"A350 Gr. LF6 Cl. 2",null,null,600,140,605,1210,1815,3025,5040,9070,null,null,null,"A182 Gr. F317",null,null,600,140,450,900,1355,2255,3760,6770]
[null,"Plates",null,null,650,125,590,1175,1765,2940,4905,8825,null,null,null,"Bar",null,null,650,125,440,885,1325,2210,3680,6625]
[null,"A203 Gr. B, E","up to 800°F/427°C",null,700,110,555,1110,1665,2775,4630,8330,null,null,null,"A182 Gr. F316, F316H",null,null,700,110,435,870,1305,2170,3620,6515]
[null,null,null,null,750,95,505,1015,1520,2535,4230,7610,null,null,null,"A479 Gr. 316, 316H",null,null,750,95,425,855,1280,2135,3560,6410]
[null,null,null,null,800,80,410,825,1235,2055,3430,6170,null,null,null,"Plates",null,null,800,80,420,845,1265,2110,3520,6335]
[null,null,null,null,850,65,320,640,955,1595,2655,4785,null,null,null,"A240 Gr. 316, 316H",null,null,850,65,420,835,1255,2090,3480,6265]
[null,null,null,null,900,50,225,445,670,1115,1855,3345,null,null,null,"A240 Gr. 317",null,null,900,50,415,830,1245,2075,3460,6230]
[null,"",null,null,950,35,135,275,410,685,1145,2055,null,null,null,"",null,null,950,35,385,775,1160,1930,3220,5795]
[null,"",null,null,1000,20,85,170,255,430,715,1285,null,null,null,"",null,null,1000,20,365,725,1090,1820,3030,5450]
[]
[null,"ASME B16.34 (2017) Group 1.3","Notes",null,"ºF",150,300,600,900,1500,2500,4500,null,null,null,"ASME B16.34 (2017) Group 2.3","Notes",null,"ºF",150,300,600,900,1500,2500,4500]
[null,"Castings",null,null,-20,265,695,1395,2090,3480,5805,10445,null,null,null,"Forgings",null,null,-20,230,600,1200,1800,3000,5000,9000]
[null,"A352 Gr. LC1, LCB","up to 650°F/343°C",null,100,265,695,1395,2090,3480,5805,10445,null,null,null,"A182 Gr. 304L","up to 800°F/427°C",null,100,230,600,1200,1800,3000,5000,9000]
[null,"A217 WC1","up to 875°F/468°C",null,200,255,660,1320,1980,3300,5505,9905,null,null,null,"A182 Gr. F316L",null,null,200,195,510,1020,1535,2555,4260,7670]
[null,"Bar",null,null,300,230,640,1275,1915,3190,5315,9565,null,null,null,"Bar",null,null,300,175,455,910,1370,2280,3800,6840]
[null,"A675 Gr. 70","up to 800°F/427°C",null,400,200,615,1230,1845,3075,5125,9225,null,null,null,"A182 Gr. F304L","up to 800°F/427°C",null,400,160,420,840,1260,2100,3500,6300]
[null,"Plates",null,null,500,170,585,1175,1760,2930,4885,8795,null,null,null,"A182 Gr. F316L",null,null,500,150,395,785,1180,1970,3280,5905]
[null,"A515 Gr. 65","up to 800°F/427°C",null,600,140,550,1105,1655,2755,4595,8270,null,null,null,"A479 Gr. 304L","up to 800°F/427°C",null,600,140,370,745,1115,1860,3100,5580]
[null,"A203 Gr. A, D","up to 800°F/427°C",null,650,125,535,1065,1600,2665,4440,7990,null,null,null,"A479 Gr. 316L",null,null,650,125,365,730,1095,1825,3040,5470]
[null,"A516 Gr. 65","up to 800°F/427°C",null,700,110,510,1025,1535,2560,4270,7685,null,null,null,"A182 Gr. F317L",null,null,700,110,360,720,1080,1800,3000,5400]
[null,null,null,null,750,95,475,955,1430,2385,3970,7150,null,null,null,"Plates",null,null,750,110,355,705,1060,1765,2940,5290]
[null,"",null,null,800,80,390,780,1175,1955,3255,5865,null,null,null,"A240 Gr. 304L","up to 800°F/427°C",null,800,80,345,690,1035,1730,2880,5185]
[null,"",null,null,850,65,300,595,895,1490,2485,4475,null,null,null,"A240 Gr. 316L",null,null,850,65,340,675,1015,1690,2820,5075]
[null,"",null,null,900,50,200,405,605,1010,1685,3035,null,null,null,"",null,null,900,"…","…","…","…","…","…","…"]
[null,"",null,null,950,35,135,275,410,685,1145,2055,null,null,null,"",null,null,950,"…","…","…","…","…","…","…"]
[null,"",null,null,1000,20,85,170,255,430,715,1285,null,null,null,"",null,null,1000,"…","…","…","…","…","…","…"]

{"sheet":"API 6D","index":2,"n_rows":53,"n_cols":26,"rows_kept":53,"cut":false,"hidden":true,"merged":[]}
["API 6D (2014) ADD. 2"]
[]
[]
[null,"API 6D (2014) Group 1.1","Notes",null,"ºF",150,300,400,600,900,1500,2500,null,null,null,"API 6D (2014) Group 2.1","Notes",null,"ºF",150,300,400,600,900,1500,2500]
[null,"Castings","",null,-20,{"$f":"'ASME B16.34'!F5","v":285},{"$f":"'ASME B16.34'!G5","v":740},{"$f":"'ASME B16.5'!H5","v":985},{"$f":"'ASME B16.34'!H5","v":1480},{"$f":"'ASME B16.34'!I5","v":2220},{"$f":"'ASME B16.34'!J5","v":3705},{"$f":"'ASME B16.34'!K5","v":6170},null,null,null,"Castings",null,null,-20,{"$f":"'ASME B16.34'!T5","v":275},{"$f":"'ASME B16.34'!U5","v":720},{"$f":"'ASME B16.5'!V5","v":960},{"$f":"'ASME B16.34'!V5","v":1440},{"$f":"'ASME B16.34'!W5","v":2160},{"$f":"'ASME B16.34'!X5","v":3600},{"$f":"'ASME B16.34'!Y5","v":6000}]
[null,"A 216 WCB","up to 800°F/427°C",null,100,{"$f":"'ASME B16.34'!F6","v":285},{"$f":"'ASME B16.34'!G6","v":740},{"$f":"'ASME B16.5'!H6","v":985},{"$f":"'ASME B16.34'!H6","v":1480},{"$f":"'ASME B16.34'!I6","v":2220},{"$f":"'ASME B16.34'!J6","v":3705},{"$f":"'ASME B16.34'!K6","v":6170},null,null,null,"A 351 Gr. CF3","up to 800°F/427°C",null,100,{"$f":"'ASME B16.34'!T6","v":275},{"$f":"'ASME B16.34'!U6","v":720},{"$f":"'ASME B16.5'!V6","v":960},{"$f":"'ASME B16.34'!V6","v":1440},{"$f":"'ASME B16.34'!W6","v":2160},{"$f":"'ASME B16.34'!X6","v":3600},{"$f":"'ASME B16.34'!Y6","v":6000}]
[null,"Forgings","",null,200,{"$f":"'ASME B16.34'!F7","v":260},{"$f":"'ASME B16.34'!G7","v":680},{"$f":"'ASME B16.5'!H7","v":905},{"$f":"'ASME B16.34'!H7","v":1360},{"$f":"'ASME B16.34'!I7","v":2035},{"$f":"'ASME B16.34'!J7","v":3395},{"$f":"'ASME B16.34'!K7","v":5655},null,null,null,"A 351 Gr. CF8",null,null,200,{"$f":"'ASME B16.34'!T7","v":230},{"$f":"'ASME B16.34'!U7","v":600},{"$f":"'ASME B16.5'!V7","v":800},{"$f":"'ASME B16.34'!V7","v":1200},{"$f":"'ASME B16.34'!W7","v":1800},{"$f":"'ASME B16.34'!X7","v":3000},{"$f":"'ASME B16.34'!Y7","v":5000}]
[null,"A 105","up to 800°F/427°C",null,300,{"$f":"'ASME B16.34'!F8","v":230},{"$f":"'ASME B16.34'!G8","v":655},{"$f":"'ASME B16.5'!H8","v":870},{"$f":"'ASME B16.34'!H8","v":1310},{"$f":"'ASME B16.34'!I8","v":1965},{"$f":"'ASME B16.34'!J8","v":3270},{"$f":"'ASME B16.34'!K8","v":5450},null,null,null,"Forgings",null,null,300,{"$f":"'ASME B16.34'!T8","v":205},{"$f":"'ASME B16.34'!U8","v":540},{"$f":"'ASME B16.5'!V8","v":715},{"$f":"'ASME B16.34'!V8","v":1075},{"$f":"'ASME B16.34'!W8","v":1615},{"$f":"'ASME B16.34'!X8","v":2690},{"$f":"'ASME B16.34'!Y8","v":4480}]
[null,"A 350 Gr. LF2","up to 800°F/427°C",null,400,{"$f":"'ASME B16.34'!F9","v":200},{"$f":"'ASME B16.34'!G9","v":635},{"$f":"'ASME B16.5'!H9","v":845},{"$f":"'ASME B16.34'!H9","v":1265},{"$f":"'ASME B16.34'!I9","v":1900},{"$f":"'ASME B16.34'!J9","v":3170},{"$f":"'ASME B16.34'!K9","v":5280},null,null,null,"A 182 Gr. F304, F304H",null,null,400,{"$f":"'ASME B16.34'!T9","v":190},{"$f":"'ASME B16.34'!U9","v":495},{"$f":"'ASME B16.5'!V9","v":660},{"$f":"'ASME B16.34'!V9","v":995},{"$f":"'ASME B16.34'!W9","v":1490},{"$f":"'ASME B16.34'!X9","v":2485},{"$f":"'ASME B16.34'!Y9","v":4140}]
[null,"A 350 Gr. LF3","up to 650°F/343°C",null,500,{"$f":"'ASME B16.34'!F10","v":170},{"$f":"'ASME B16.34'!G10","v":605},{"$f":"'ASME B16.5'!H10","v":805},{"$f":"'ASME B16.34'!H10","v":1205},{"$f":"'ASME B16.34'!I10","v":1810},{"$f":"'ASME B16.34'!J10","v":3015},{"$f":"'ASME B16.34'!K10","v":5025},null,null,null,"Bar (CL400 not applicable)",null,null,500,{"$f":"'ASME B16.34'!T10","v":170},{"$f":"'ASME B16.34'!U10","v":465},{"$f":"'ASME B16.5'!V10","v":620},{"$f":"'ASME B16.34'!V10","v":930},{"$f":"'ASME B16.34'!W10","v":1395},{"$f":"'ASME B16.34'!X10","v":2330},{"$f":"'ASME B16.34'!Y10","v":3880}]
[null,"A 350 Gr. LF6 Cl. 1","up to 500°F/260°C",null,600,{"$f":"'ASME B16.34'!F11","v":140},{"$f":"'ASME B16.34'!G11","v":570},{"$f":"'ASME B16.5'!H11","v":755},{"$f":"'ASME B16.34'!H11","v":1135},{"$f":"'ASME B16.34'!I11","v":1705},{"$f":"'ASME B16.34'!J11","v":2840},{"$f":"'ASME B16.34'!K11","v":4730},null,null,null,"A 182 Gr. F304, F304H",null,null,600,{"$f":"'ASME B16.34'!T11","v":140},{"$f":"'ASME B16.34'!U11","v":440},{"$f":"'ASME B16.5'!V11","v":590},{"$f":"'ASME B16.34'!V11","v":885},{"$f":"'ASME B16.34'!W11","v":1325},{"$f":"'ASME B16.34'!X11","v":2210},{"$f":"'ASME B16.34'!Y11","v":3680}]
[null,"Bar (CL400 not applicable)","",null,650,{"$f":"'ASME B16.34'!F12","v":125},{"$f":"'ASME B16.34'!G12","v":550},{"$f":"'ASME B16.5'!H12","v":730},{"$f":"'ASME B16.34'!H12","v":1100},{"$f":"'ASME B16.34'!I12","v":1650},{"$f":"'ASME B16.34'!J12","v":2745},{"$f":"'ASME B16.34'!K12","v":4575},null,null,null,"A 479 Gr. 304, 304H",null,null,650,{"$f":"'ASME B16.34'!T12","v":125},{"$f":"'ASME B16.34'!U12","v":430},{"$f":"'ASME B16.5'!V12","v":575},{"$f":"'ASME B16.34'!V12","v":865},{"$f":"'ASME B16.34'!W12","v":1295},{"$f":"'ASME B16.34'!X12","v":2160},{"$f":"'ASME B16.34'!Y12","v":3600}]
[null,"A 105","up to 800°F/427°C",null,700,{"$f":"'ASME B16.34'!F13","v":110},{"$f":"'ASME B16.34'!G13","v":530},{"$f":"'ASME B16.5'!H13","v":710},{"$f":"'ASME B16.34'!H13","v":1060},{"$f":"'ASME B16.34'!I13","v":1590},{"$f":"'ASME B16.34'!J13","v":2655},{"$f":"'ASME B16.34'!K13","v":4425},null,null,null,"Plates",null,null,700,{"$f":"'ASME B16.34'!T13","v":110},{"$f":"'ASME B16.34'!U13","v":420},{"$f":"'ASME B16.5'!V13","v":565},{"$f":"'ASME B16.34'!V13","v":845},{"$f":"'ASME B16.34'!W13","v":1265},{"$f":"'ASME B16.34'!X13","v":2110},{"$f":"'ASME B16.34'!Y13","v":3520}]
[null,"A 350 Gr. LF2","up to 800°F/427°C",null,750,{"$f":"'ASME B16.34'!F14","v":95},{"$f":"'ASME B16.34'!G14","v":505},{"$f":"'ASME B16.5'!H14","v":675},{"$f":"'ASME B16.34'!H14","v":1015},{"$f":"'ASME B16.34'!I14","v":1520},{"$f":"'ASME B16.34'!J14","v":2535},{"$f":"'ASME B16.34'!K14","v":4230},null,null,null,"A 240 Gr. 304, 304H",null,null,750,{"$f":"'ASME B16.34'!T14","v":95},{"$f":"'ASME B16.34'!U14","v":415},{"$f":"'ASME B16.5'!V14","v":550},{"$f":"'ASME B16.34'!V14","v":825},{"$f":"'ASME B16.34'!W14","v":1240},{"$f":"'ASME B16.34'!X14","v":2065},{"$f":"'ASME B16.34'!Y14","v":3440}]
[null,"A 696 Gr. C","",null,800,{"$f":"'ASME B16.34'!F15","v":80},{"$f":"'ASME B16.34'!G15","v":410},{"$f":"'ASME B16.5'!H15","v":550},{"$f":"'ASME B16.34'!H15","v":825},{"$f":"'ASME B16.34'!I15","v":1235},{"$f":"'ASME B16.34'!J15","v":2055},{"$f":"'ASME B16.34'!K15","v":3430},null,null,null,null,null,null,800,{"$f":"'ASME B16.34'!T15","v":80},{"$f":"'ASME B16.34'!U15","v":405},{"$f":"'ASME B16.5'!V15","v":540},{"$f":"'ASME B16.34'!V15","v":810},{"$f":"'ASME B16.34'!W15","v":1215},{"$f":"'ASME B16.34'!X15","v":2030},{"$f":"'ASME B16.34'!Y15","v":3380}]
[null,"","",null,850,{"$f":"'ASME B16.34'!F16","v":65},{"$f":"'ASME B16.34'!G16","v":320},{"$f":"'ASME B16.5'!H16","v":425},{"$f":"'ASME B16.34'!H16","v":640},{"$f":"'ASME B16.34'!I16","v":955},{"$f":"'ASME B16.34'!J16","v":1595},{"$f":"'ASME B16.34'!K16","v":2655},null,null,null,null,null,null,850,{"$f":"'ASME B16.34'!T16","v":65},{"$f":"'ASME B16.34'!U16","v":395},{"$f":"'ASME B16.5'!V16","v":530},{"$f":"'ASME B16.34'!V16","v":790},{"$f":"'ASME B16.34'!W16","v":1190},{"$f":"'ASME B16.34'!X16","v":1980},{"$f":"'ASME B16.34'!Y16","v":3300}]
[null,"","",null,900,{"$f":"'ASME B16.34'!F17","v":50},{"$f":"'ASME B16.34'!G17","v":230},{"$f":"'ASME B16.5'!H17","v":305},{"$f":"'ASME B16.34'!H17","v":460},{"$f":"'ASME B16.34'!I17","v":690},{"$f":"'ASME B16.34'!J17","v":1150},{"$f":"'ASME B16.34'!K17","v":1915},null,null,null,null,null,null,900,{"$f":"'ASME B16.34'!T17","v":50},{"$f":"'ASME B16.34'!U17","v":390},{"$f":"'ASME B16.5'!V17","v":520},{"$f":"'ASME B16.34'!V17","v":780},{"$f":"'ASME B16.34'!W17","v":1165},{"$f":"'ASME B16.34'!X17","v":1945},{"$f":"'ASME B16.34'!Y17","v":3240}]
[null,"","",null,950,{"$f":"'ASME B16.34'!F18","v":35},{"$f":"'ASME B16.34'!G18","v":135},{"$f":"'ASME B16.5'!H18","v":185},{"$f":"'ASME B16.34'!H18","v":275},{"$f":"'ASME B16.34'!I18","v":410},{"$f":"'ASME B16.34'!J18","v":685},{"$f":"'ASME B16.34'!K18","v":1145},null,null,null,null,null,null,950,{"$f":"'ASME B16.34'!T18","v":35},{"$f":"'ASME B16.34'!U18","v":380},{"$f":"'ASME B16.5'!V18","v":510},{"$f":"'ASME B16.34'!V18","v":765},{"$f":"'ASME B16.34'!W18","v":1145},{"$f":"'ASME B16.34'!X18","v":1910},{"$f":"'ASME B16.34'!Y18","v":3180}]
[null,"","",null,1000,{"$f":"'ASME B16.34'!F19","v":20},{"$f":"'ASME B16.34'!G19","v":85},{"$f":"'ASME B16.5'!H19","v":115},{"$f":"'ASME B16.34'!H19","v":170},{"$f":"'ASME B16.34'!I19","v":255},{"$f":"'ASME B16.34'!J19","v":430},{"$f":"'ASME B16.34'!K19","v":715},null,null,null,"",null,null,1000,{"$f":"'ASME B16.34'!T19","v":20},{"$f":"'ASME B16.34'!U19","v":355},{"$f":"'ASME B16.5'!V19","v":470},{"$f":"'ASME B16.34'!V19","v":710},{"$f":"'ASME B16.34'!W19","v":1065},{"$f":"'ASME B16.34'!X19","v":1770},{"$f":"'ASME B16.34'!Y19","v":2950}]
[]
[null,"API 6D (2014) Group 1.2","Notes",null,"ºF",150,300,400,600,900,1500,2500,null,null,null,"API 6D (2014) Group 2.2","Notes",null,"ºF",150,300,400,600,900,1500,2500]
[null,"Castings",null,null,-20,{"$f":"'ASME B16.34'!F22","v":290},{"$f":"'ASME B16.34'!G22","v":750},{"$f":"'ASME B16.5'!H22","v":1000},{"$f":"'ASME B16.34'!H22","v":1500},{"$f":"'ASME B16.34'!I22","v":2250},{"$f":"'ASME B16.34'!J22","v":3750},{"$f":"'ASME B16.34'!K22","v":6250},null,null,null,"Castings",null,null,-20,{"$f":"'ASME B16.34'!T22","v":275},{"$f":"'ASME B16.34'!U22","v":720},{"$f":"'ASME B16.5'!V22","v":960},{"$f":"'ASME B16.34'!V22","v":1440},{"$f":"'ASME B16.34'!W22","v":2160},{"$f":"'ASME B16.34'!X22","v":3600},{"$f":"'ASME B16.34'!Y22","v":6000}]
[null,"A 352 Gr. LC2, LC3, LCC","up to 650°F/343°C",null,100,{"$f":"'ASME B16.34'!F23","v":290},{"$f":"'ASME B16.34'!G23","v":750},{"$f":"'ASME B16.5'!H23","v":1000},{"$f":"'ASME B16.34'!H23","v":1500},{"$f":"'ASME B16.34'!I23","v":2250},{"$f":"'ASME B16.34'!J23","v":3750},{"$f":"'ASME B16.34'!K23","v":6250},null,null,null,"A 351 Gr. CF3M, CF8M, CG8M",null,null,100,{"$f":"'ASME B16.34'!T23","v":275},{"$f":"'ASME B16.34'!U23","v":720},{"$f":"'ASME B16.5'!V23","v":960},{"$f":"'ASME B16.34'!V23","v":1440},{"$f":"'ASME B16.34'!W23","v":2160},{"$f":"'ASME B16.34'!X23","v":3600},{"$f":"'ASME B16.34'!Y23","v":6000}]
[null,"A 216 Gr. WCC","up to 800°F/427°C",null,200,{"$f":"'ASME B16.34'!F24","v":260},{"$f":"'ASME B16.34'!G24","v":750},{"$f":"'ASME B16.5'!H24","v":1000},{"$f":"'ASME B16.34'!H24","v":1500},{"$f":"'ASME B16.34'!I24","v":2250},{"$f":"'ASME B16.34'!J24","v":3750},{"$f":"'ASME B16.34'!K24","v":6250},null,null,null,"A 351 Gr. CF3A","up to 650°F/343°C; CL400 not applicable",null,200,{"$f":"'ASME B16.34'!T24","v":235},{"$f":"'ASME B16.34'!U24","v":620},{"$f":"'ASME B16.5'!V24","v":825},{"$f":"'ASME B16.34'!V24","v":1240},{"$f":"'ASME B16.34'!W24","v":1860},{"$f":"'ASME B16.34'!X24","v":3095},{"$f":"'ASME B16.34'!Y24","v":5160}]
[null,"Forgings",null,null,300,{"$f":"'ASME B16.34'!F25","v":230},{"$f":"'ASME B16.34'!G25","v":730},{"$f":"'ASME B16.5'!H25","v":970},{"$f":"'ASME B16.34'!H25","v":1455},{"$f":"'ASME B16.34'!I25","v":2185},{"$f":"'ASME B16.34'!J25","v":3640},{"$f":"'ASME B16.34'!K25","v":6070},null,null,null,"A 351 Gr. CF8A","up to 650°F/343°C",null,300,{"$f":"'ASME B16.34'!T25","v":215},{"$f":"'ASME B16.34'!U25","v":560},{"$f":"'ASME B16.5'!V25","v":745},{"$f":"'ASME B16.34'!V25","v":1120},{"$f":"'ASME B16.34'!W25","v":1680},{"$f":"'ASME B16.34'!X25","v":2795},{"$f":"'ASME B16.34'!Y25","v":4660}]
[null,"A 350 Gr. LF6 Cl. 2","up to 500°F/260°C",null,400,{"$f":"'ASME B16.34'!F26","v":200},{"$f":"'ASME B16.34'!G26","v":705},{"$f":"'ASME B16.5'!H26","v":940},{"$f":"'ASME B16.34'!H26","v":1405},{"$f":"'ASME B16.34'!I26","v":2110},{"$f":"'ASME B16.34'!J26","v":3520},{"$f":"'ASME B16.34'!K26","v":5865},null,null,null,"Forgings",null,null,400,{"$f":"'ASME B16.34'!T26","v":195},{"$f":"'ASME B16.34'!U26","v":515},{"$f":"'ASME B16.5'!V26","v":685},{"$f":"'ASME B16.34'!V26","v":1025},{"$f":"'ASME B16.34'!W26","v":1540},{"$f":"'ASME B16.34'!X26","v":2570},{"$f":"'ASME B16.34'!Y26","v":4280}]
[null,"Plates",null,null,500,{"$f":"'ASME B16.34'!F27","v":170},{"$f":"'ASME B16.34'!G27","v":665},{"$f":"'ASME B16.5'!H27","v":885},{"$f":"'ASME B16.34'!H27","v":1330},{"$f":"'ASME B16.34'!I27","v":1995},{"$f":"'ASME B16.34'!J27","v":3325},{"$f":"'ASME B16.34'!K27","v":5540},null,null,null,"A 182 Gr. F316, F316H",null,null,500,{"$f":"'ASME B16.34'!T27","v":170},{"$f":"'ASME B16.34'!U27","v":480},{"$f":"'ASME B16.5'!V27","v":635},{"$f":"'ASME B16.34'!V27","v":955},{"$f":"'ASME B16.34'!W27","v":1435},{"$f":"'ASME B16.34'!X27","v":2390},{"$f":"'ASME B16.34'!Y27","v":3980}]
[null,"A 203 Gr. B","up to 800°F/427°C",null,600,{"$f":"'ASME B16.34'!F28","v":140},{"$f":"'ASME B16.34'!G28","v":605},{"$f":"'ASME B16.5'!H28","v":805},{"$f":"'ASME B16.34'!H28","v":1210},{"$f":"'ASME B16.34'!I28","v":1815},{"$f":"'ASME B16.34'!J28","v":3025},{"$f":"'ASME B16.34'!K28","v":5040},null,null,null,"A 182 Gr. F317","CL400 not applicable",null,600,{"$f":"'ASME B16.34'!T28","v":140},{"$f":"'ASME B16.34'!U28","v":450},{"$f":"'ASME B16.5'!V28","v":600},{"$f":"'ASME B16.34'!V28","v":900},{"$f":"'ASME B16.34'!W28","v":1355},{"$f":"'ASME B16.34'!X28","v":2255},{"$f":"'ASME B16.34'!Y28","v":3760}]
[null,"A 203 Gr. E","up to 800°F/427°C",null,650,{"$f":"'ASME B16.34'!F29","v":125},{"$f":"'ASME B16.34'!G29","v":590},{"$f":"'ASME B16.5'!H29","v":785},{"$f":"'ASME B16.34'!H29","v":1175},{"$f":"'ASME B16.34'!I29","v":1765},{"$f":"'ASME B16.34'!J29","v":2940},{"$f":"'ASME B16.34'!K29","v":4905},null,null,null,"A 182 Gr. 317H",null,null,650,{"$f":"'ASME B16.34'!T29","v":125},{"$f":"'ASME B16.34'!U29","v":440},{"$f":"'ASME B16.5'!V29","v":590},{"$f":"'ASME B16.34'!V29","v":885},{"$f":"'ASME B16.34'!W29","v":1325},{"$f":"'ASME B16.34'!X29","v":2210},{"$f":"'ASME B16.34'!Y29","v":3680}]
[null,null,null,null,700,{"$f":"'ASME B16.34'!F30","v":110},{"$f":"'ASME B16.34'!G30","v":555},{"$f":"'ASME B16.5'!H30","v":740},{"$f":"'ASME B16.34'!H30","v":1110},{"$f":"'ASME B16.34'!I30","v":1665},{"$f":"'ASME B16.34'!J30","v":2775},{"$f":"'ASME B16.34'!K30","v":4630},null,null,null,"Bar (CL400 not applicable)",null,null,700,{"$f":"'ASME B16.34'!T30","v":110},{"$f":"'ASME B16.34'!U30","v":435},{"$f":"'ASME B16.5'!V30","v":580},{"$f":"'ASME B16.34'!V30","v":870},{"$f":"'ASME B16.34'!W30","v":1305},{"$f":"'ASME B16.34'!X30","v":2170},{"$f":"'ASME B16.34'!Y30","v":3620}]
[null,null,null,null,750,{"$f":"'ASME B16.34'!F31","v":95},{"$f":"'ASME B16.34'!G31","v":505},{"$f":"'ASME B16.5'!H31","v":675},{"$f":"'ASME B16.34'!H31","v":1015},{"$f":"'ASME B16.34'!I31","v":1520},{"$f":"'ASME B16.34'!J31","v":2535},{"$f":"'ASME B16.34'!K31","v":4230},null,null,null,"A 182 Gr. F316, F316H",null,null,750,{"$f":"'ASME B16.34'!T31","v":95},{"$f":"'ASME B16.34'!U31","v":425},{"$f":"'ASME B16.5'!V31","v":570},{"$f":"'ASME B16.34'!V31","v":855},{"$f":"'ASME B16.34'!W31","v":1280},{"$f":"'ASME B16.34'!X31","v":2135},{"$f":"'ASME B16.34'!Y31","v":3560}]
[null,null,null,null,800,{"$f":"'ASME B16.34'!F32","v":80},{"$f":"'ASME B16.34'!G32","v":410},{"$f":"'ASME B16.5'!H32","v":550},{"$f":"'ASME B16.34'!H32","v":825},{"$f":"'ASME B16.34'!I32","v":1235},{"$f":"'ASME B16.34'!J32","v":2055},{"$f":"'ASME B16.34'!K32","v":3430},null,null,null,"A 479 Gr. 316, 316H",null,null,800,{"$f":"'ASME B16.34'!T32","v":80},{"$f":"'ASME B16.34'!U32","v":420},{"$f":"'ASME B16.5'!V32","v":565},{"$f":"'ASME B16.34'!V32","v":845},{"$f":"'ASME B16.34'!W32","v":1265},{"$f":"'ASME B16.34'!X32","v":2110},{"$f":"'ASME B16.34'!Y32","v":3520}]
[null,null,null,null,850,{"$f":"'ASME B16.34'!F33","v":65},{"$f":"'ASME B16.34'!G33","v":320},{"$f":"'ASME B16.5'!H33","v":425},{"$f":"'ASME B16.34'!H33","v":640},{"$f":"'ASME B16.34'!I33","v":955},{"$f":"'ASME B16.34'!J33","v":1595},{"$f":"'ASME B16.34'!K33","v":2655},null,null,null,"Plates",null,null,850,{"$f":"'ASME B16.34'!T33","v":65},{"$f":"'ASME B16.34'!U33","v":420},{"$f":"'ASME B16.5'!V33","v":555},{"$f":"'ASME B16.34'!V33","v":835},{"$f":"'ASME B16.34'!W33","v":1255},{"$f":"'ASME B16.34'!X33","v":2090},{"$f":"'ASME B16.34'!Y33","v":3480}]
[null,null,null,null,900,{"$f":"'ASME B16.34'!F34","v":50},{"$f":"'ASME B16.34'!G34","v":225},{"$f":"'ASME B16.5'!H34","v":295},{"$f":"'ASME B16.34'!H34","v":445},{"$f":"'ASME B16.34'!I34","v":670},{"$f":"'ASME B16.34'!J34","v":1115},{"$f":"'ASME B16.34'!K34","v":1855},null,null,null,"A 240 Gr. 316, 316H",null,null,900,{"$f":"'ASME B16.34'!T34","v":50},{"$f":"'ASME B16.34'!U34","v":415},{"$f":"'ASME B16.5'!V34","v":555},{"$f":"'ASME B16.34'!V34","v":830},{"$f":"'ASME B16.34'!W34","v":1245},{"$f":"'ASME B16.34'!X34","v":2075},{"$f":"'ASME B16.34'!Y34","v":3460}]
[null,"",null,null,950,{"$f":"'ASME B16.34'!F35","v":35},{"$f":"'ASME B16.34'!G35","v":135},{"$f":"'ASME B16.5'!H35","v":185},{"$f":"'ASME B16.34'!H35","v":275},{"$f":"'ASME B16.34'!I35","v":410},{"$f":"'ASME B16.34'!J35","v":685},{"$f":"'ASME B16.34'!K35","v":1145},null,null,null,"A 240 Gr. 317, 317H",null,null,950,{"$f":"'ASME B16.34'!T35","v":35},{"$f":"'ASME B16.34'!U35","v":385},{"$f":"'ASME B16.5'!V35","v":515},{"$f":"'ASME B16.34'!V35","v":775},{"$f":"'ASME B16.34'!W35","v":1160},{"$f":"'ASME B16.34'!X35","v":1930},{"$f":"'ASME B16.34'!Y35","v":3220}]
[null,"",null,null,1000,{"$f":"'ASME B16.34'!F36","v":20},{"$f":"'ASME B16.34'!G36","v":85},{"$f":"'ASME B16.5'!H36","v":115},{"$f":"'ASME B16.34'!H36","v":170},{"$f":"'ASME B16.34'!I36","v":255},{"$f":"'ASME B16.34'!J36","v":430},{"$f":"'ASME B16.34'!K36","v":715},null,null,null,"",null,null,1000,{"$f":"'ASME B16.34'!T36","v":20},{"$f":"'ASME B16.34'!U36","v":365},{"$f":"'ASME B16.5'!V36","v":485},{"$f":"'ASME B16.34'!V36","v":725},{"$f":"'ASME B16.34'!W36","v":1090},{"$f":"'ASME B16.34'!X36","v":1820},{"$f":"'ASME B16.34'!Y36","v":3030}]
[]
[null,"API 6D (2014) Group 1.3","Notes",null,"ºF",150,300,400,600,900,1500,2500,null,null,null,"API 6D (2014) Group 2.3","Notes",null,"ºF",150,300,400,600,900,1500,2500]
[null,"Castings",null,null,-20,{"$f":"'ASME B16.34'!F39","v":265},{"$f":"'ASME B16.34'!G39","v":695},{"$f":"'ASME B16.5'!H39","v":930},{"$f":"'ASME B16.34'!H39","v":1395},{"$f":"'ASME B16.34'!I39","v":2090},{"$f":"'ASME B16.34'!J39","v":3480},{"$f":"'ASME B16.34'!K39","v":5805},null,null,null,"Forgings",null,null,-20,{"$f":"'ASME B16.34'!T39","v":230},{"$f":"'ASME B16.34'!U39","v":600},{"$f":"'ASME B16.5'!V39","v":800},{"$f":"'ASME B16.34'!V39","v":1200},{"$f":"'ASME B16.34'!W39","v":1800},{"$f":"'ASME B16.34'!X39","v":3000},{"$f":"'ASME B16.34'!Y39","v":5000}]
[null,"A 352 Gr. LC1, LCB","up to 650°F/343°C",null,100,{"$f":"'ASME B16.34'!F40","v":265},{"$f":"'ASME B16.34'!G40","v":695},{"$f":"'ASME B16.5'!H40","v":930},{"$f":"'ASME B16.34'!H40","v":1395},{"$f":"'ASME B16.34'!I40","v":2090},{"$f":"'ASME B16.34'!J40","v":3480},{"$f":"'ASME B16.34'!K40","v":5805},null,null,null,"A 182 Gr. 304L","up to 800°F/427°C",null,100,{"$f":"'ASME B16.34'!T40","v":230},{"$f":"'ASME B16.34'!U40","v":600},{"$f":"'ASME B16.5'!V40","v":800},{"$f":"'ASME B16.34'!V40","v":1200},{"$f":"'ASME B16.34'!W40","v":1800},{"$f":"'ASME B16.34'!X40","v":3000},{"$f":"'ASME B16.34'!Y40","v":5000}]
[null,"A 217 WC1","up to 875°F/468°C",null,200,{"$f":"'ASME B16.34'!F41","v":255},{"$f":"'ASME B16.34'!G41","v":660},{"$f":"'ASME B16.5'!H41","v":880},{"$f":"'ASME B16.34'!H41","v":1320},{"$f":"'ASME B16.34'!I41","v":1980},{"$f":"'ASME B16.34'!J41","v":3300},{"$f":"'ASME B16.34'!K41","v":5505},null,null,null,"A 182 Gr. F316L",null,null,200,{"$f":"'ASME B16.34'!T41","v":195},{"$f":"'ASME B16.34'!U41","v":510},{"$f":"'ASME B16.5'!V41","v":680},{"$f":"'ASME B16.34'!V41","v":1020},{"$f":"'ASME B16.34'!W41","v":1535},{"$f":"'ASME B16.34'!X41","v":2555},{"$f":"'ASME B16.34'!Y41","v":4260}]
[null,"Bar (CL400 not applicable)",null,null,300,{"$f":"'ASME B16.34'!F42","v":230},{"$f":"'ASME B16.34'!G42","v":640},{"$f":"'ASME B16.5'!H42","v":850},{"$f":"'ASME B16.34'!H42","v":1275},{"$f":"'ASME B16.34'!I42","v":1915},{"$f":"'ASME B16.34'!J42","v":3190},{"$f":"'ASME B16.34'!K42","v":5315},null,null,null,"Bar (CL400 not applicable)",null,null,300,{"$f":"'ASME B16.34'!T42","v":175},{"$f":"'ASME B16.34'!U42","v":455},{"$f":"'ASME B16.5'!V42","v":610},{"$f":"'ASME B16.34'!V42","v":910},{"$f":"'ASME B16.34'!W42","v":1370},{"$f":"'ASME B16.34'!X42","v":2280},{"$f":"'ASME B16.34'!Y42","v":3800}]
[null,"A 675 Gr. 70","[not confirmed in B16.34 (2004) Table VII-2-1.3]",null,400,{"$f":"'ASME B16.34'!F43","v":200},{"$f":"'ASME B16.34'!G43","v":615},{"$f":"'ASME B16.5'!H43","v":820},{"$f":"'ASME B16.34'!H43","v":1230},{"$f":"'ASME B16.34'!I43","v":1845},{"$f":"'ASME B16.34'!J43","v":3075},{"$f":"'ASME B16.34'!K43","v":5125},null,null,null,"A 182 Gr. F304L","up to 800°F/427°C",null,400,{"$f":"'ASME B16.34'!T43","v":160},{"$f":"'ASME B16.34'!U43","v":420},{"$f":"'ASME B16.5'!V43","v":560},{"$f":"'ASME B16.34'!V43","v":840},{"$f":"'ASME B16.34'!W43","v":1260},{"$f":"'ASME B16.34'!X43","v":2100},{"$f":"'ASME B16.34'!Y43","v":3500}]
[null,"Plates",null,null,500,{"$f":"'ASME B16.34'!F44","v":170},{"$f":"'ASME B16.34'!G44","v":585},{"$f":"'ASME B16.5'!H44","v":780},{"$f":"'ASME B16.34'!H44","v":1175},{"$f":"'ASME B16.34'!I44","v":1760},{"$f":"'ASME B16.34'!J44","v":2930},{"$f":"'ASME B16.34'!K44","v":4885},null,null,null,"A 182 Gr. F316L",null,null,500,{"$f":"'ASME B16.34'!T44","v":150},{"$f":"'ASME B16.34'!U44","v":395},{"$f":"'ASME B16.5'!V44","v":525},{"$f":"'ASME B16.34'!V44","v":785},{"$f":"'ASME B16.34'!W44","v":1180},{"$f":"'ASME B16.34'!X44","v":1970},{"$f":"'ASME B16.34'!Y44","v":3280}]
[null,"A 515 Gr. 65","up to 800°F/427°C",null,600,{"$f":"'ASME B16.34'!F45","v":140},{"$f":"'ASME B16.34'!G45","v":550},{"$f":"'ASME B16.5'!H45","v":735},{"$f":"'ASME B16.34'!H45","v":1105},{"$f":"'ASME B16.34'!I45","v":1655},{"$f":"'ASME B16.34'!J45","v":2755},{"$f":"'ASME B16.34'!K45","v":4595},null,null,null,"A 479 Gr. 304L","up to 800°F/427°C",null,600,{"$f":"'ASME B16.34'!T45","v":140},{"$f":"'ASME B16.34'!U45","v":370},{"$f":"'ASME B16.5'!V45","v":495},{"$f":"'ASME B16.34'!V45","v":745},{"$f":"'ASME B16.34'!W45","v":1115},{"$f":"'ASME B16.34'!X45","v":1860},{"$f":"'ASME B16.34'!Y45","v":3100}]
[null,"A 203 Gr. A, D","up to 800°F/427°C",null,650,{"$f":"'ASME B16.34'!F46","v":125},{"$f":"'ASME B16.34'!G46","v":535},{"$f":"'ASME B16.5'!H46","v":710},{"$f":"'ASME B16.34'!H46","v":1065},{"$f":"'ASME B16.34'!I46","v":1600},{"$f":"'ASME B16.34'!J46","v":2665},{"$f":"'ASME B16.34'!K46","v":4440},null,null,null,"A 479 Gr. 316L",null,null,650,{"$f":"'ASME B16.34'!T46","v":125},{"$f":"'ASME B16.34'!U46","v":365},{"$f":"'ASME B16.5'!V46","v":485},{"$f":"'ASME B16.34'!V46","v":730},{"$f":"'ASME B16.34'!W46","v":1095},{"$f":"'ASME B16.34'!X46","v":1825},{"$f":"'ASME B16.34'!Y46","v":3040}]
[null,"A 516 Gr. 65","up to 800°F/427°C; CL400 not applicable",null,700,{"$f":"'ASME B16.34'!F47","v":110},{"$f":"'ASME B16.34'!G47","v":510},{"$f":"'ASME B16.5'!H47","v":685},{"$f":"'ASME B16.34'!H47","v":1025},{"$f":"'ASME B16.34'!I47","v":1535},{"$f":"'ASME B16.34'!J47","v":2560},{"$f":"'ASME B16.34'!K47","v":4270},null,null,null,"Plates",null,null,700,{"$f":"'ASME B16.34'!T47","v":110},{"$f":"'ASME B16.34'!U47","v":360},{"$f":"'ASME B16.5'!V47","v":480},{"$f":"'ASME B16.34'!V47","v":720},{"$f":"'ASME B16.34'!W47","v":1080},{"$f":"'ASME B16.34'!X47","v":1800},{"$f":"'ASME B16.34'!Y47","v":3000}]
[null,null,null,null,750,{"$f":"'ASME B16.34'!F48","v":95},{"$f":"'ASME B16.34'!G48","v":475},{"$f":"'ASME B16.5'!H48","v":635},{"$f":"'ASME B16.34'!H48","v":955},{"$f":"'ASME B16.34'!I48","v":1430},{"$f":"'ASME B16.34'!J48","v":2385},{"$f":"'ASME B16.34'!K48","v":3970},null,null,null,"A 240 Gr. 321, 321H",null,null,750,{"$f":"'ASME B16.34'!T48","v":110},{"$f":"'ASME B16.34'!U48","v":355},{"$f":"'ASME B16.5'!V48","v":470},{"$f":"'ASME B16.34'!V48","v":705},{"$f":"'ASME B16.34'!W48","v":1060},{"$f":"'ASME B16.34'!X48","v":1765},{"$f":"'ASME B16.34'!Y48","v":2940}]
[null,"",null,null,800,{"$f":"'ASME B16.34'!F49","v":80},{"$f":"'ASME B16.34'!G49","v":390},{"$f":"'ASME B16.5'!H49","v":520},{"$f":"'ASME B16.34'!H49","v":780},{"$f":"'ASME B16.34'!I49","v":1175},{"$f":"'ASME B16.34'!J49","v":1955},{"$f":"'ASME B16.34'!K49","v":3255},null,null,null,"",null,null,800,{"$f":"'ASME B16.34'!T49","v":80},{"$f":"'ASME B16.34'!U49","v":345},{"$f":"'ASME B16.5'!V49","v":460},{"$f":"'ASME B16.34'!V49","v":690},{"$f":"'ASME B16.34'!W49","v":1035},{"$f":"'ASME B16.34'!X49","v":1730},{"$f":"'ASME B16.34'!Y49","v":2880}]
[null,"",null,null,850,{"$f":"'ASME B16.34'!F50","v":65},{"$f":"'ASME B16.34'!G50","v":300},{"$f":"'ASME B16.5'!H50","v":400},{"$f":"'ASME B16.34'!H50","v":595},{"$f":"'ASME B16.34'!I50","v":895},{"$f":"'ASME B16.34'!J50","v":1490},{"$f":"'ASME B16.34'!K50","v":2485},null,null,null,"",null,null,850,{"$f":"'ASME B16.34'!T50","v":65},{"$f":"'ASME B16.34'!U50","v":340},{"$f":"'ASME B16.5'!V50","v":450},{"$f":"'ASME B16.34'!V50","v":675},{"$f":"'ASME B16.34'!W50","v":1015},{"$f":"'ASME B16.34'!X50","v":1690},{"$f":"'ASME B16.34'!Y50","v":2820}]
[null,"",null,null,900,{"$f":"'ASME B16.34'!F51","v":50},{"$f":"'ASME B16.34'!G51","v":200},{"$f":"'ASME B16.5'!H51","v":270},{"$f":"'ASME B16.34'!H51","v":405},{"$f":"'ASME B16.34'!I51","v":605},{"$f":"'ASME B16.34'!J51","v":1010},{"$f":"'ASME B16.34'!K51","v":1685},null,null,null,"",null,null,900,{"$f":"'ASME B16.34'!T51","v":"…"},{"$f":"'ASME B16.34'!U51","v":"…"},{"$f":"'ASME B16.5'!V51","v":"…"},{"$f":"'ASME B16.34'!V51","v":"…"},{"$f":"'ASME B16.34'!W51","v":"…"},{"$f":"'ASME B16.34'!X51","v":"…"},{"$f":"'ASME B16.34'!Y51","v":"…"}]
[null,"",null,null,950,{"$f":"'ASME B16.34'!F52","v":35},{"$f":"'ASME B16.34'!G52","v":135},{"$f":"'ASME B16.5'!H52","v":185},{"$f":"'ASME B16.34'!H52","v":275},{"$f":"'ASME B16.34'!I52","v":410},{"$f":"'ASME B16.34'!J52","v":685},{"$f":"'ASME B16.34'!K52","v":1145},null,null,null,"",null,null,950,{"$f":"'ASME B16.34'!T52","v":"…"},{"$f":"'ASME B16.34'!U52","v":"…"},{"$f":"'ASME B16.5'!V52","v":"…"},{"$f":"'ASME B16.34'!V52","v":"…"},{"$f":"'ASME B16.34'!W52","v":"…"},{"$f":"'ASME B16.34'!X52","v":"…"},{"$f":"'ASME B16.34'!Y52","v":"…"}]
[null,"",null,null,1000,{"$f":"'ASME B16.34'!F53","v":20},{"$f":"'ASME B16.34'!G53","v":85},{"$f":"'ASME B16.5'!H53","v":115},{"$f":"'ASME B16.34'!H53","v":170},{"$f":"'ASME B16.34'!I53","v":255},{"$f":"'ASME B16.34'!J53","v":430},{"$f":"'ASME B16.34'!K53","v":715},null,null,null,"",null,null,1000,{"$f":"'ASME B16.34'!T53","v":"…"},{"$f":"'ASME B16.34'!U53","v":"…"},{"$f":"'ASME B16.5'!V53","v":"…"},{"$f":"'ASME B16.34'!V53","v":"…"},{"$f":"'ASME B16.34'!W53","v":"…"},{"$f":"'ASME B16.34'!X53","v":"…"},{"$f":"'ASME B16.34'!Y53","v":"…"}]

{"sheet":"ASME B16.5","index":3,"n_rows":53,"n_cols":26,"rows_kept":53,"cut":false,"hidden":true,"merged":[]}
["ASME B16.5 (2017)"]
[]
[]
[null,"ASME B16.5 (2017) Group 1.1","Notes",null,"ºF",150,300,400,600,900,1500,2500,null,null,null,"ASME B16.5 (2017) Group 2.1","Notes",null,"ºF",150,300,400,600,900,1500,2500]
[null,"Castings",null,null,-20,285,740,985,1480,2220,3705,6170,null,null,null,"Castings",null,null,-20,275,720,960,1440,2160,3600,6000]
[null,"A 216 WCB","up to 800°F/427°C",null,100,285,740,985,1480,2220,3705,6170,null,null,null,"A 351 Gr. CF3","up to 800°F/427°C",null,100,275,720,960,1440,2160,3600,6000]
[null,"Forgings",null,null,200,260,680,905,1360,2035,3395,5655,null,null,null,"A 351 Gr. CF8",null,null,200,230,600,800,1200,1800,3000,5000]
[null,"A 105","up to 800°F/427°C",null,300,230,655,870,1310,1965,3270,5450,null,null,null,"Forgings",null,null,300,205,540,715,1075,1615,2690,4480]
[null,"A 350 Gr. LF2","up to 800°F/427°C",null,400,200,635,845,1265,1900,3170,5280,null,null,null,"A 182 Gr. F304",null,null,400,190,495,660,995,1490,2485,4140]
[null,"A 350 Gr. LF3",null,null,500,170,605,805,1205,1810,3015,5025,null,null,null,"A 182 Gr. F304H",null,null,500,170,465,620,930,1395,2330,3880]
[null,"A 350 Gr. LF6 Cl. 1","up to 500°F/260°C",null,600,140,570,755,1135,1705,2840,4730,null,null,null,"Plates",null,null,600,140,440,590,885,1325,2210,3680]
[null,"Plates",null,null,650,125,550,730,1100,1650,2745,4575,null,null,null,"A 240 Gr. 304",null,null,650,125,430,575,865,1295,2160,3600]
[null,"A 515 Gr. 70","up to 800°F/427°C",null,700,110,530,710,1060,1590,2655,4425,null,null,null,"A 240 Gr. 304H",null,null,700,110,420,565,845,1265,2110,3520]
[null,"A 516 Gr. 70","up to 800°F/427°C",null,750,95,505,675,1015,1520,2535,4230,null,null,null,null,null,null,750,95,415,550,825,1240,2065,3440]
[null,"A 537 Cl. 1 ","up to 700°F/371°C",null,800,80,410,550,825,1235,2055,3430,null,null,null,"",null,null,800,80,405,540,810,1215,2030,3380]
[null,"",null,null,850,65,320,425,640,955,1595,2655,null,null,null,"",null,null,850,65,395,530,790,1190,1980,3300]
[null,"",null,null,900,50,230,305,460,690,1150,1915,null,null,null,"",null,null,900,50,390,520,780,1165,1945,3240]
[null,"",null,null,950,35,135,185,275,410,685,1145,null,null,null,"",null,null,950,35,380,510,765,1145,1910,3180]
[null,"",null,null,1000,20,85,115,170,255,430,715,null,null,null,"",null,null,1000,20,355,470,710,1065,1770,2950]
[]
[null,"ASME B16.5 (2017) Group 1.2","Notes",null,"ºF",150,300,400,600,900,1500,2500,null,null,null,"ASME B16.5 (2017) Group 2.2","Notes",null,"ºF",150,300,400,600,900,1500,2500]
[null,"Castings",null,null,-20,290,750,1000,1500,2250,3750,6250,null,null,null,"Castings",null,null,-20,275,720,960,1440,2160,3600,6000]
[null,"A 216 Gr. WCC","up to 800°F/427°C",null,100,290,750,1000,1500,2250,3750,6250,null,null,null,"A 351 Gr. CF3M ","up to 850°F/454°C",null,100,275,720,960,1440,2160,3600,6000]
[null,"A 352 Gr. LCC","up to 650°F/343°C",null,200,260,750,1000,1500,2250,3750,6250,null,null,null,"A 351 Gr. CF8M, CG8M",null,null,200,235,620,825,1240,1860,3095,5160]
[null,"A 352 Gr. LC2",null,null,300,230,730,970,1455,2185,3640,6070,null,null,null,"Forgings",null,null,300,215,560,745,1120,1680,2795,4660]
[null,"A 352 Gr. LC3","up to 650°F/343°C",null,400,200,705,940,1405,2110,3520,5865,null,null,null,"A 182 Gr. F316, 316H",null,null,400,195,515,685,1025,1540,2570,4280]
[null,"Forgings",null,null,500,170,665,885,1330,1995,3325,5540,null,null,null,"A 182 Gr. F317",null,null,500,170,480,635,955,1435,2390,3980]
[null,"A 350 Gr. LF6 Cl. 2","up to 500°F/260°C",null,600,140,605,805,1210,1815,3025,5040,null,null,null,"Plates",null,null,600,140,450,600,900,1355,2255,3760]
[null,"Plates",null,null,650,125,590,785,1175,1765,2940,4905,null,null,null,"A 240 Gr. 316, 316H",null,null,650,125,440,590,885,1325,2210,3680]
[null,"A 203 Gr. B, E","up to 800°F/427°C",null,700,110,555,740,1110,1665,2775,4630,null,null,null,"A 240 Gr. 317",null,null,700,110,435,580,870,1305,2170,3620]
[null,null,null,null,750,95,505,675,1015,1520,2535,4230,null,null,null,null,null,null,750,95,425,570,855,1280,2135,3560]
[null,"",null,null,800,80,410,550,825,1235,2055,3430,null,null,null,null,null,null,800,80,420,565,845,1265,2110,3520]
[null,"",null,null,850,65,320,425,640,955,1595,2655,null,null,null,null,null,null,850,65,420,555,835,1255,2090,3480]
[null,"",null,null,900,50,225,295,445,670,1115,1855,null,null,null,"",null,null,900,50,415,555,830,1245,2075,3460]
[null,"",null,null,950,35,135,185,275,410,685,1145,null,null,null,"",null,null,950,35,385,515,775,1160,1930,3220]
[null,"",null,null,1000,20,85,115,170,255,430,715,null,null,null,"",null,null,1000,20,365,485,725,1090,1820,3030]
[]
[null,"ASME B16.5 (2017) Group 1.3","Notes",null,"ºF",150,300,400,600,900,1500,2500,null,null,null,"ASME B16.5 (2017) Group 2.3","Notes",null,"ºF",150,300,400,600,900,1500,2500]
[null,"Castings",null,null,-20,265,695,930,1395,2090,3480,5805,null,null,null,"Forgings",null,null,-20,230,600,800,1200,1800,3000,5000]
[null,"A 352 Gr. LC1, LCB ","up to 650°F/343°C",null,100,265,695,930,1395,2090,3480,5805,null,null,null,"A 182 Gr. F304L","up to 800°F/427°C",null,100,230,600,800,1200,1800,3000,5000]
[null,"A 217 Gr. WC1","up to 875°F/468°C",null,200,255,660,880,1320,1980,3300,5505,null,null,null,"A 182 Gr. F316L, 317L",null,null,200,195,510,680,1020,1535,2555,4260]
[null,"Plates",null,null,300,230,640,850,1275,1915,3190,5315,null,null,null,"Plates",null,null,300,175,455,610,910,1370,2280,3800]
[null,"A 515 Gr. 65","up to 800°F/427°C",null,400,200,615,820,1230,1845,3075,5125,null,null,null,"A 240 Gt. 304L","up to 800°F/427°C",null,400,160,420,560,840,1260,2100,3500]
[null,"A 516 Gr. 65","up to 800°F/427°C",null,500,170,585,780,1175,1760,2930,4885,null,null,null,"A 240 Gt. 316L",null,null,500,150,395,525,785,1180,1970,3280]
[null,"A 203 Gr. A, D","up to 800°F/427°C",null,600,140,550,735,1105,1655,2755,4595,null,null,null,null,null,null,600,140,370,495,745,1115,1860,3100]
[null,null,null,null,650,125,535,710,1065,1600,2665,4440,null,null,null,null,null,null,650,125,365,485,730,1095,1825,3040]
[null,null,null,null,700,110,510,685,1025,1535,2560,4270,null,null,null,null,null,null,700,110,360,480,720,1080,1800,3000]
[null,null,null,null,750,95,475,635,955,1430,2385,3970,null,null,null,null,null,null,750,95,355,470,705,1060,1765,2940]
[null,"",null,null,800,80,390,520,780,1175,1955,3255,null,null,null,null,null,null,800,80,345,460,690,1035,1730,2880]
[null,"",null,null,850,65,300,400,595,895,1490,2485,null,null,null,null,null,null,850,65,340,450,675,1015,1690,2820]
[null,"",null,null,900,50,200,270,405,605,1010,1685,null,null,null,"",null,null,900,"…","…","…","…","…","…","…"]
[null,"",null,null,950,35,135,185,275,410,685,1145,null,null,null,"",null,null,950,"…","…","…","…","…","…","…"]
[null,"",null,null,1000,20,85,115,170,255,430,715,null,null,null,"",null,null,1000,"…","…","…","…","…","…","…"]